Reaction Details
TargetLeucyl-cystinyl aminopeptidase
LigandBDBM50331046
Substrate/Competitorn/a
Meas. Tech.ChEMBL_684890 (CHEMBL1286214)
Ki 357±n/a nM
Citation Andersson, HDemaegdt, HVauquelin, GLindeberg, GKarlén, AHallberg, MErdélyi, MHallberg, A Disulfide cyclized tripeptide analogues of angiotensin IV as potent and selective inhibitors of insulin-regulated aminopeptidase (IRAP). J Med Chem53:8059-71 (2010) 
 
Leucyl-cystinyl aminopeptidase
Name:Leucyl-cystinyl aminopeptidase
Type:PROTEIN
Mol. Mass.:117334.10
Organism:Homo sapiens (Human)
Description:ChEMBL_1473494
Residue:1025
BDBM50331046
NameBDBM50331046
Synonyms:2-(2-(((5S,9S,12S)-12-amino-9-(4-hydroxybenzyl)-7,11-dioxo-1,2-dithia-6,10-diazacyclotetradecane-5-carboxamido)methyl)phenyl)acetic acid | CHEMBL1277811
TypeSmall organic molecule
Emp. Form.C27H34N4O6S2
Mol. Mass.574.712
SMILESN[C@H]1CCSSCC[C@H](NC(=O)C[C@H](Cc2ccc(O)cc2)NC1=O)C(=O)NCc1ccccc1CC(O)=O