Reaction Details
TargetLeucyl-cystinyl aminopeptidase
LigandBDBM50331048
Substrate/Competitorn/a
Meas. Tech.ChEMBL_684891 (CHEMBL1286215)
Ki 20±n/a nM
Citation Andersson, HDemaegdt, HVauquelin, GLindeberg, GKarlén, AHallberg, MErdélyi, MHallberg, A Disulfide cyclized tripeptide analogues of angiotensin IV as potent and selective inhibitors of insulin-regulated aminopeptidase (IRAP). J Med Chem53:8059-71 (2010) 
 
Leucyl-cystinyl aminopeptidase
Name:Leucyl-cystinyl aminopeptidase
Type:PROTEIN
Mol. Mass.:117334.10
Organism:Homo sapiens (Human)
Description:ChEMBL_1473494
Residue:1025
BDBM50331048
NameBDBM50331048
Synonyms:CHEMBL1277437 | ethyl 2-acetamido-7-hydroxy-4-(quinolin-3-yl)-4H-chromene-3-carboxylate
TypeSmall organic molecule
Emp. Form.C23H20N2O5
Mol. Mass.404.4153
SMILESCCOC(=O)C1=C(NC(C)=O)Oc2cc(O)ccc2C1c1cnc2ccccc2c1