Reaction Details
TargetVascular endothelial growth factor receptor 2
LigandBDBM50331081
Substrate/Competitorn/a
Meas. Tech.ChEMBL_686224 (CHEMBL1292980)
IC50 4.2±n/a nM
Citation Lee, KJeong, KWLee, YSong, JYKim, MSLee, GSKim, Y Pharmacophore modeling and virtual screening studies for new VEGFR-2 kinase inhibitors. Eur J Med Chem45:5420-7 (2010) 
 
Vascular endothelial growth factor receptor 2
Name:Vascular endothelial growth factor receptor 2
Type:Receptor Tyrosine Kinase
Mol. Mass.:151510.97
Organism:Homo sapiens (Human)
Description:P35968
Residue:1356
BDBM50331081
NameBDBM50331081
Synonyms:2-(2-(3-(3-chlorophenyl)ureido)thiazol-4-yl)-N-(6-methylbenzo[d]thiazol-2-yl)acetamide | CHEMBL1290471
TypeSmall organic molecule
Emp. Form.C20H16ClN5O2S2
Mol. Mass.457.956
SMILESCc1ccc2nc(NC(=O)Cc3csc(NC(=O)Nc4cccc(Cl)c4)n3)sc2c1