Reaction Details
TargetVascular endothelial growth factor receptor 2
LigandBDBM50331083
Substrate/Competitorn/a
Meas. Tech.ChEMBL_686224 (CHEMBL1292980)
IC50 2.9±n/a nM
Citation Lee, KJeong, KWLee, YSong, JYKim, MSLee, GSKim, Y Pharmacophore modeling and virtual screening studies for new VEGFR-2 kinase inhibitors. Eur J Med Chem45:5420-7 (2010) 
 
Vascular endothelial growth factor receptor 2
Name:Vascular endothelial growth factor receptor 2
Type:Receptor Tyrosine Kinase
Mol. Mass.:151510.97
Organism:Homo sapiens (Human)
Description:P35968
Residue:1356
BDBM50331083
NameBDBM50331083
Synonyms:CHEMBL1290362 | ethyl 2-(3-methyl-7-(3-methylbenzyl)-2,6-dioxo-2,3,6,7-tetrahydro-1H-purin-8-ylthio)acetate
TypeSmall organic molecule
Emp. Form.C18H20N4O4S
Mol. Mass.388.441
SMILESCCOC(=O)CSc1nc2n(C)c(=O)[nH]c(=O)c2n1Cc1cccc(C)c1