Reaction Details
TargetVascular endothelial growth factor receptor 2
LigandBDBM50331091
Substrate/Competitorn/a
Meas. Tech.ChEMBL_686224 (CHEMBL1292980)
IC50 0.34±n/a nM
Citation Lee, KJeong, KWLee, YSong, JYKim, MSLee, GSKim, Y Pharmacophore modeling and virtual screening studies for new VEGFR-2 kinase inhibitors. Eur J Med Chem45:5420-7 (2010) 
 
Vascular endothelial growth factor receptor 2
Name:Vascular endothelial growth factor receptor 2
Type:Receptor Tyrosine Kinase
Mol. Mass.:151510.97
Organism:Homo sapiens (Human)
Description:P35968
Residue:1356
BDBM50331091
NameBDBM50331091
Synonyms:AG-028262 N-methyl-6-(2-(1-methyl-4,5-dihydro-1H-imidazol-2-yl)thieno[3,2-b]pyridin-7-yloxy)benzo[b]thiophene-3-carboxamide
TypeSmall organic molecule
Emp. Form.C21H18N4O2S2
Mol. Mass.422.523
SMILESCNC(=O)c1csc2cc(Oc3ccnc4cc(sc34)C3=NCCN3C)ccc12