Reaction Details
TargetMelanin-concentrating hormone receptor 1
LigandBDBM50331161
Substrate/Competitorn/a
Meas. Tech.ChEMBL_686508 (CHEMBL1292295)
Ki 2.6±n/a nM
Citation Surman, MDFreeman, EEGrabowski, JFHadden, MHenderson, AJJiang, GJiang, XMLuche, MKhmelnitsky, YVickers, SViggers, JCheetham, SGuzzo, PR 5-(pyridinon-1-yl)indazoles and 5-(furopyridinon-5-yl)indazoles as MCH-1 antagonists. Bioorg Med Chem Lett20:7015-9 (2010) 
 
Melanin-concentrating hormone receptor 1
Name:Melanin-concentrating hormone receptor 1
Type:G Protein-Coupled Receptor (GPCR)
Mol. Mass.:45976.27
Organism:Homo sapiens (Human)
Description:Membranes from CHO-K1 cells stably expressing human MCH1R were used in assays.
Residue:422
BDBM50331161
NameBDBM50331161
Synonyms:4-(benzyloxy)-1-(1-(2-(pyrrolidin-1-yl)ethyl)-1H-indazol-5-yl)pyridin-2(1H)-one | CHEMBL1289283
TypeSmall organic molecule
Emp. Form.C25H26N4O2
Mol. Mass.414.4995
SMILESO=c1cc(OCc2ccccc2)ccn1-c1ccc2n(CCN3CCCC3)ncc2c1