Reaction Details
TargetMelanin-concentrating hormone receptor 1
LigandBDBM50331244
Substrate/Competitorn/a
Meas. Tech.ChEMBL_686508 (CHEMBL1292295)
Ki 9.7±n/a nM
Citation Surman, MDFreeman, EEGrabowski, JFHadden, MHenderson, AJJiang, GJiang, XMLuche, MKhmelnitsky, YVickers, SViggers, JCheetham, SGuzzo, PR 5-(pyridinon-1-yl)indazoles and 5-(furopyridinon-5-yl)indazoles as MCH-1 antagonists. Bioorg Med Chem Lett20:7015-9 (2010) 
 
Melanin-concentrating hormone receptor 1
Name:Melanin-concentrating hormone receptor 1
Type:G Protein-Coupled Receptor (GPCR)
Mol. Mass.:45976.27
Organism:Homo sapiens (Human)
Description:Membranes from CHO-K1 cells stably expressing human MCH1R were used in assays.
Residue:422
BDBM50331244
NameBDBM50331244
Synonyms:2-phenyl-5-(1-(2-(pyrrolidin-1-yl)ethyl)-1H-indazol-5-yl)furo[3,2-c]pyridin-4(5H)-one | CHEMBL1290266
TypeSmall organic molecule
Emp. Form.C26H24N4O2
Mol. Mass.424.4944
SMILESO=c1n(ccc2oc(cc12)-c1ccccc1)-c1ccc2n(CCN3CCCC3)ncc2c1