Reaction Details
TargetDeath-associated protein kinase 1
LigandBDBM50331277
Substrate/Competitorn/a
Meas. Tech.ChEMBL_686610 (CHEMBL1292405)
IC50>30000±n/a nM
Citation Herdemann, MHeit, IBosch, FUQuintini, GScheipers, CWeber, A Identification of potent ITK inhibitors through focused compound library design including structural information. Bioorg Med Chem Lett20:6998-7003 (2010) 
 
Death-associated protein kinase 1
Name:Death-associated protein kinase 1
Type:PROTEIN
Mol. Mass.:160053.35
Organism:Homo sapiens (Human)
Description:ChEMBL_1517177
Residue:1430
BDBM50331277
NameBDBM50331277
Synonyms:3-(6-methoxy-1H-indol-2-yl)-1H-pyrazolo[4,3-b]pyridine | CHEMBL1288582
TypeSmall organic molecule
Emp. Form.C15H12N4O
Mol. Mass.264.282
SMILESCOc1ccc2cc([nH]c2c1)-c1n[nH]c2cccnc12