Reaction Details
TargetTyrosine-protein kinase ITK/TSK
LigandBDBM50331257
Substrate/Competitorn/a
Meas. Tech.ChEMBL_686535 (CHEMBL1292322)
IC50 140±n/a nM
Citation Herdemann, MHeit, IBosch, FUQuintini, GScheipers, CWeber, A Identification of potent ITK inhibitors through focused compound library design including structural information. Bioorg Med Chem Lett20:6998-7003 (2010) 
 
Tyrosine-protein kinase ITK/TSK
Name:Tyrosine-protein kinase ITK/TSK
Type:Protein
Mol. Mass.:71839.20
Organism:Homo sapiens (Human)
Description:Q08881
Residue:620
BDBM50331257
NameBDBM50331257
Synonyms:3-(1H-indol-2-yl)-1H-indazole | CHEMBL1288974
TypeSmall organic molecule
Emp. Form.C15H11N3
Mol. Mass.233.2679
SMILESc1c([nH]c2ccccc12)-c1n[nH]c2ccccc12