Reaction Details
TargetTyrosine-protein kinase ITK/TSK
LigandBDBM50331258
Substrate/Competitorn/a
Meas. Tech.ChEMBL_686535 (CHEMBL1292322)
IC50 120±n/a nM
Citation Herdemann, MHeit, IBosch, FUQuintini, GScheipers, CWeber, A Identification of potent ITK inhibitors through focused compound library design including structural information. Bioorg Med Chem Lett20:6998-7003 (2010) 
 
Tyrosine-protein kinase ITK/TSK
Name:Tyrosine-protein kinase ITK/TSK
Type:Protein
Mol. Mass.:71839.20
Organism:Homo sapiens (Human)
Description:Q08881
Residue:620
BDBM50331258
NameBDBM50331258
Synonyms:3-(5-methoxy-1H-indol-2-yl)-1H-indazole | CHEMBL1288975
TypeSmall organic molecule
Emp. Form.C16H13N3O
Mol. Mass.263.2939
SMILESCOc1ccc2[nH]c(cc2c1)-c1n[nH]c2ccccc12