Reaction Details
TargetTyrosine-protein kinase ITK/TSK
LigandBDBM50331265
Substrate/Competitorn/a
Meas. Tech.ChEMBL_686535 (CHEMBL1292322)
IC50 160±n/a nM
Citation Herdemann, MHeit, IBosch, FUQuintini, GScheipers, CWeber, A Identification of potent ITK inhibitors through focused compound library design including structural information. Bioorg Med Chem Lett20:6998-7003 (2010) 
 
Tyrosine-protein kinase ITK/TSK
Name:Tyrosine-protein kinase ITK/TSK
Type:Protein
Mol. Mass.:71839.20
Organism:Homo sapiens (Human)
Description:Q08881
Residue:620
BDBM50331265
NameBDBM50331265
Synonyms:3-(1H-indol-2-yl)-6-methyl-1H-indazole | CHEMBL1288317
TypeSmall organic molecule
Emp. Form.C16H13N3
Mol. Mass.247.2945
SMILESCc1ccc2c(n[nH]c2c1)-c1cc2ccccc2[nH]1