Reaction Details
TargetTyrosine-protein kinase ITK/TSK
LigandBDBM50331266
Substrate/Competitorn/a
Meas. Tech.ChEMBL_686535 (CHEMBL1292322)
IC50 170±n/a nM
Citation Herdemann, MHeit, IBosch, FUQuintini, GScheipers, CWeber, A Identification of potent ITK inhibitors through focused compound library design including structural information. Bioorg Med Chem Lett20:6998-7003 (2010) 
 
Tyrosine-protein kinase ITK/TSK
Name:Tyrosine-protein kinase ITK/TSK
Type:Protein
Mol. Mass.:71839.20
Organism:Homo sapiens (Human)
Description:Q08881
Residue:620
BDBM50331266
NameBDBM50331266
Synonyms:5-fluoro-3-(1H-indol-2-yl)-1H-indazole | CHEMBL1288385
TypeSmall organic molecule
Emp. Form.C15H10FN3
Mol. Mass.251.2584
SMILESFc1ccc2[nH]nc(-c3cc4ccccc4[nH]3)c2c1