Reaction Details
TargetTyrosine-protein kinase ITK/TSK
LigandBDBM50331272
Substrate/Competitorn/a
Meas. Tech.ChEMBL_686535 (CHEMBL1292322)
IC50 140±n/a nM
Citation Herdemann, MHeit, IBosch, FUQuintini, GScheipers, CWeber, A Identification of potent ITK inhibitors through focused compound library design including structural information. Bioorg Med Chem Lett20:6998-7003 (2010) 
 
Tyrosine-protein kinase ITK/TSK
Name:Tyrosine-protein kinase ITK/TSK
Type:Protein
Mol. Mass.:71839.20
Organism:Homo sapiens (Human)
Description:Q08881
Residue:620
BDBM50331272
NameBDBM50331272
Synonyms:6-fluoro-3-(6-methyl-1H-indol-2-yl)-1H-indazole | CHEMBL1288551
TypeSmall organic molecule
Emp. Form.C16H12FN3
Mol. Mass.265.285
SMILESCc1ccc2cc([nH]c2c1)-c1n[nH]c2cc(F)ccc12