Reaction Details
TargetTyrosine-protein kinase ITK/TSK
LigandBDBM50331275
Substrate/Competitorn/a
Meas. Tech.ChEMBL_686535 (CHEMBL1292322)
IC50 200±n/a nM
Citation Herdemann, MHeit, IBosch, FUQuintini, GScheipers, CWeber, A Identification of potent ITK inhibitors through focused compound library design including structural information. Bioorg Med Chem Lett20:6998-7003 (2010) 
 
Tyrosine-protein kinase ITK/TSK
Name:Tyrosine-protein kinase ITK/TSK
Type:Protein
Mol. Mass.:71839.20
Organism:Homo sapiens (Human)
Description:Q08881
Residue:620
BDBM50331275
NameBDBM50331275
Synonyms:3-(1H-indol-2-yl)-1H-pyrazolo[4,3-b]pyridine | CHEMBL1288552
TypeSmall organic molecule
Emp. Form.C14H10N4
Mol. Mass.234.256
SMILESc1c([nH]c2ccccc12)-c1n[nH]c2cccnc12