Reaction Details
TargetTyrosine-protein kinase ITK/TSK
LigandBDBM50331278
Substrate/Competitorn/a
Meas. Tech.ChEMBL_686535 (CHEMBL1292322)
IC50 27000±n/a nM
Citation Herdemann, MHeit, IBosch, FUQuintini, GScheipers, CWeber, A Identification of potent ITK inhibitors through focused compound library design including structural information. Bioorg Med Chem Lett20:6998-7003 (2010) 
 
Tyrosine-protein kinase ITK/TSK
Name:Tyrosine-protein kinase ITK/TSK
Type:Protein
Mol. Mass.:71839.20
Organism:Homo sapiens (Human)
Description:Q08881
Residue:620
BDBM50331278
NameBDBM50331278
Synonyms:3-(7-methoxy-1H-indol-2-yl)-1H-pyrazolo[4,3-b]pyridine | CHEMBL1288583
TypeSmall organic molecule
Emp. Form.C15H12N4O
Mol. Mass.264.282
SMILESCOc1cccc2cc([nH]c12)-c1n[nH]c2cccnc12