Reaction Details
TargetTyrosine-protein kinase ITK/TSK
LigandBDBM50331279
Substrate/Competitorn/a
Meas. Tech.ChEMBL_686535 (CHEMBL1292322)
IC50 300±n/a nM
Citation Herdemann, MHeit, IBosch, FUQuintini, GScheipers, CWeber, A Identification of potent ITK inhibitors through focused compound library design including structural information. Bioorg Med Chem Lett20:6998-7003 (2010) 
 
Tyrosine-protein kinase ITK/TSK
Name:Tyrosine-protein kinase ITK/TSK
Type:Protein
Mol. Mass.:71839.20
Organism:Homo sapiens (Human)
Description:Q08881
Residue:620
BDBM50331279
NameBDBM50331279
Synonyms:3-(5-methyl-1H-indol-2-yl)-1H-pyrazolo[4,3-b]pyridine | CHEMBL1288584
TypeSmall organic molecule
Emp. Form.C15H12N4
Mol. Mass.248.2826
SMILESCc1ccc2[nH]c(cc2c1)-c1n[nH]c2cccnc12