Reaction Details
TargetSerine/threonine-protein kinase PAK 2
LigandBDBM50331277
Substrate/Competitorn/a
Meas. Tech.ChEMBL_686617 (CHEMBL1292412)
IC50>30000±n/a nM
Citation Herdemann, MHeit, IBosch, FUQuintini, GScheipers, CWeber, A Identification of potent ITK inhibitors through focused compound library design including structural information. Bioorg Med Chem Lett20:6998-7003 (2010) 
 
Serine/threonine-protein kinase PAK 2
Name:Serine/threonine-protein kinase PAK 2
Type:Enzyme
Mol. Mass.:58037.40
Organism:Homo sapiens (Human)
Description:Q13177
Residue:524
BDBM50331277
NameBDBM50331277
Synonyms:3-(6-methoxy-1H-indol-2-yl)-1H-pyrazolo[4,3-b]pyridine | CHEMBL1288582
TypeSmall organic molecule
Emp. Form.C15H12N4O
Mol. Mass.264.282
SMILESCOc1ccc2cc([nH]c2c1)-c1n[nH]c2cccnc12