Reaction Details
TargetLymphokine-activated killer T-cell-originated protein kinase
LigandBDBM50331277
Substrate/Competitorn/a
Meas. Tech.ChEMBL_686618 (CHEMBL1292413)
IC50>30000±n/a nM
Citation Herdemann, MHeit, IBosch, FUQuintini, GScheipers, CWeber, A Identification of potent ITK inhibitors through focused compound library design including structural information. Bioorg Med Chem Lett20:6998-7003 (2010) 
 
Lymphokine-activated killer T-cell-originated protein kinase
Name:Lymphokine-activated killer T-cell-originated protein kinase
Type:n/a
Mol. Mass.:36072.55
Organism:Homo sapiens (Human)
Description:n/a
Residue:322
BDBM50331277
NameBDBM50331277
Synonyms:3-(6-methoxy-1H-indol-2-yl)-1H-pyrazolo[4,3-b]pyridine | CHEMBL1288582
TypeSmall organic molecule
Emp. Form.C15H12N4O
Mol. Mass.264.282
SMILESCOc1ccc2cc([nH]c2c1)-c1n[nH]c2cccnc12