Reaction Details
TargetWee1-like protein kinase
LigandBDBM50331277
Substrate/Competitorn/a
Meas. Tech.ChEMBL_686628 (CHEMBL1292423)
IC50 5720±n/a nM
Citation Herdemann, MHeit, IBosch, FUQuintini, GScheipers, CWeber, A Identification of potent ITK inhibitors through focused compound library design including structural information. Bioorg Med Chem Lett20:6998-7003 (2010) 
 
Wee1-like protein kinase
Name:Wee1-like protein kinase
Type:PROTEIN
Mol. Mass.:71599.12
Organism:Homo sapiens (Human)
Description:ChEMBL_1445054
Residue:646
BDBM50331277
NameBDBM50331277
Synonyms:3-(6-methoxy-1H-indol-2-yl)-1H-pyrazolo[4,3-b]pyridine | CHEMBL1288582
TypeSmall organic molecule
Emp. Form.C15H12N4O
Mol. Mass.264.282
SMILESCOc1ccc2cc([nH]c2c1)-c1n[nH]c2cccnc12