Reaction Details
TargetSigma non-opioid intracellular receptor 1
LigandBDBM50331301
Substrate/Competitorn/a
Meas. Tech.ChEMBL_686645 (CHEMBL1292498)
Ki>1000±n/a nM
Citation Tewes, BFrehland, BSchepmann, DSchmidtke, KUWinckler, TWünsch, B Conformationally constrained NR2B selective NMDA receptor antagonists derived from ifenprodil: Synthesis and biological evaluation of tetrahydro-3-benzazepine-1,7-diols. Bioorg Med Chem18:8005-15 (2010) 
 
Sigma non-opioid intracellular receptor 1
Name:Sigma non-opioid intracellular receptor 1
Type:Protein
Mol. Mass.:25307.17
Organism:Cavia porcellus (Guinea pig)
Description:Q60492
Residue:223
BDBM50331301
NameBDBM50331301
Synonyms:(+/-)-7-(Benzyloxy)-3-(3-phenylbenzyl)-2,3,4,5-tetrahydro-1H-3-benzazepin-1-ol | CHEMBL1290497
TypeSmall organic molecule
Emp. Form.C30H29NO2
Mol. Mass.435.5568
SMILESOC1CN(Cc2cccc(c2)-c2ccccc2)CCc2cc(OCc3ccccc3)ccc12