Reaction Details
TargetSigma non-opioid intracellular receptor 1
LigandBDBM50331303
Substrate/Competitorn/a
Meas. Tech.ChEMBL_686645 (CHEMBL1292498)
Ki 183±n/a nM
Citation Tewes, BFrehland, BSchepmann, DSchmidtke, KUWinckler, TWünsch, B Conformationally constrained NR2B selective NMDA receptor antagonists derived from ifenprodil: Synthesis and biological evaluation of tetrahydro-3-benzazepine-1,7-diols. Bioorg Med Chem18:8005-15 (2010) 
 
Sigma non-opioid intracellular receptor 1
Name:Sigma non-opioid intracellular receptor 1
Type:Protein
Mol. Mass.:25307.17
Organism:Cavia porcellus (Guinea pig)
Description:Q60492
Residue:223
BDBM50331303
NameBDBM50331303
Synonyms:(+/-)-7-Benzyloxy-3-(1,4-dioxaspiro[4.5]decan-8-yl)-2,3,4,5-tetrahydro-1H-3-benzazepin-1-ol | CHEMBL1290607
TypeSmall organic molecule
Emp. Form.C25H31NO4
Mol. Mass.409.5179
SMILESOC1CN(CCc2cc(OCc3ccccc3)ccc12)C1CCC2(CC1)OCCO2