Reaction Details
TargetSigma non-opioid intracellular receptor 1
LigandBDBM50331317
Substrate/Competitorn/a
Meas. Tech.ChEMBL_686645 (CHEMBL1292498)
Ki>1000±n/a nM
Citation Tewes, BFrehland, BSchepmann, DSchmidtke, KUWinckler, TWünsch, B Conformationally constrained NR2B selective NMDA receptor antagonists derived from ifenprodil: Synthesis and biological evaluation of tetrahydro-3-benzazepine-1,7-diols. Bioorg Med Chem18:8005-15 (2010) 
 
Sigma non-opioid intracellular receptor 1
Name:Sigma non-opioid intracellular receptor 1
Type:Protein
Mol. Mass.:25307.17
Organism:Cavia porcellus (Guinea pig)
Description:Q60492
Residue:223
BDBM50331317
NameBDBM50331317
Synonyms:(+/-)-3-(1-Benzoylpiperidin-4-yl)2,3,4,5-tetrahydro-1H-3-benzazepine-1,7-diol | CHEMBL1289836
TypeSmall organic molecule
Emp. Form.C22H26N2O3
Mol. Mass.366.4534
SMILESOC1CN(CCc2cc(O)ccc12)C1CCN(CC1)C(=O)c1ccccc1