Reaction Details
TargetGlutamate receptor ionotropic, NMDA 1/2B
LigandBDBM50331316
Substrate/Competitorn/a
Meas. Tech.ChEMBL_686641 (CHEMBL1292494)
Ki>1000±n/a nM
Citation Tewes, BFrehland, BSchepmann, DSchmidtke, KUWinckler, TWünsch, B Conformationally constrained NR2B selective NMDA receptor antagonists derived from ifenprodil: Synthesis and biological evaluation of tetrahydro-3-benzazepine-1,7-diols. Bioorg Med Chem18:8005-15 (2010) 
 
Glutamate receptor ionotropic, NMDA 1/2B
Name:Glutamate receptor ionotropic, NMDA 1/2B
Type:Enzyme
Mol. Mass.:n/a
Description:n/a
Components:This complex has 2 components.
Component 1
Name:Glutamate receptor ionotropic, NMDA 1
Synonyms:GRIN1 Glutamate [NMDA] receptor subunit zeta-1 N-methyl-D-aspartate receptor subunit NR1 NMDZ1_HUMAN | phencyclidine
Type:Enzyme Catalytic Domain
Mol. Mass.:105397.81
Organism:Homo sapiens (Human)
Description:Q05586
Residue:938
Component 2
Name:Glutamate receptor ionotropic, NMDA 2B
Synonyms:GRIN2B Glutamate [NMDA] receptor subunit epsilon 2 N-methyl D-aspartate receptor subtype 2B NMDAR2B NR3 | hNR3
Type:PROTEIN
Mol. Mass.:166375.46
Organism:Homo sapiens (Human)
Description:ChEMBL_1438829
Residue:1484
BDBM50331316
NameBDBM50331316
Synonyms:(+/-)-trans-3-(2-Phenyl-1,3-dioxan-5-yl)-2,3,4,5-tetrahydro-1H-3-benzazepine-1,7-diol | CHEMBL1289733
TypeSmall organic molecule
Emp. Form.C20H23NO4
Mol. Mass.341.4009
SMILESOC1CN(CCc2cc(O)ccc12)[C@H]1CO[C@@H](OC1)c1ccccc1