Reaction Details
Target11-beta-hydroxysteroid dehydrogenase 1
LigandBDBM50331365
Substrate/Competitorn/a
Meas. Tech.ChEMBL_687130 (CHEMBL1291707)
IC50 1.2±n/a nM
Citation Yan, XWang, ZSudom, ACardozo, MDeGraffenreid, MDi, YFan, PHe, XJaen, JCLabelle, MLiu, JMa, JMcMinn, DMiao, SSun, DTang, LTu, HUrsu, SWalker, NYe, QPowers, JP The synthesis and SAR of novel diarylsulfone 11ß-HSD1 inhibitors. Bioorg Med Chem Lett20:7071-5 (2010) 
 
11-beta-hydroxysteroid dehydrogenase 1
Name:11-beta-hydroxysteroid dehydrogenase 1
Type:Enzyme
Mol. Mass.:32409.16
Organism:Homo sapiens (Human)
Description:P28845
Residue:292
BDBM50331365
NameBDBM50331365
Synonyms:(S)-3'-(2-fluoroethyl)-4'-(4-(1,1,1-trifluoro-2-hydroxypropan-2-yl)phenylsulfonyl)biphenyl-4-carbonitrile | CHEMBL1289629
TypeSmall organic molecule
Emp. Form.C24H19F4NO3S
Mol. Mass.477.471
SMILESC[C@](O)(c1ccc(cc1)S(=O)(=O)c1ccc(cc1CCF)-c1ccc(cc1)C#N)C(F)(F)F