Reaction Details
TargetPotassium voltage-gated channel subfamily A member 3
LigandBDBM50185446
Substrate/Competitorn/a
Meas. Tech.ChEMBL_687185 (CHEMBL1291810)
IC50 740±n/a nM
Citation Haffner, CDThomson, SAGuo, YSchaller, LTBoggs, SDickerson, SGobel, JGillie, DCondreay, JP N-{3-[(1,1-dioxido-1,2-benzothiazol-3-yl)(phenyl)amino]propyl}benzamide analogs as potent Kv1.3 inhibitors. Part 1. Bioorg Med Chem Lett20:6983-8 (2010) 
 
Potassium voltage-gated channel subfamily A member 3
Name:Potassium voltage-gated channel subfamily A member 3
Type:PROTEIN
Mol. Mass.:63835.47
Organism:Homo sapiens (Human)
Description:ChEMBL_1513935
Residue:575
BDBM50185446
NameBDBM50185446
Synonyms:(E)-1-(2,4-dihydroxy-6-methoxyphenyl)-3-phenylprop-2-en-1-one cardamomin | cardamonin
TypeSmall organic molecule
Emp. Form.C16H14O4
Mol. Mass.270.28
SMILESCOc1cc(O)cc(O)c1C(=O)\C=C\c1ccccc1