Reaction Details
TargetPotassium voltage-gated channel subfamily A member 5
LigandBDBM50279106
Substrate/Competitorn/a
Meas. Tech.ChEMBL_687189 (CHEMBL1291814)
IC50 3450±n/a nM
Citation Haffner, CDThomson, SAGuo, YPetrov, KLarkin, ABanker, PSchaaf, GDickerson, SGobel, JGillie, DCondreay, JPPoole, CCarpenter, TUlrich, J Substituted N-{3-[(1,1-dioxido-1,2-benzothiazol-3-yl)(phenyl)amino]propyl}benzamide analogs as potent Kv1.3 ion channel blockers. Part 2. Bioorg Med Chem Lett20:6989-92 (2010) 
 
Potassium voltage-gated channel subfamily A member 5
Name:Potassium voltage-gated channel subfamily A member 5
Type:Enzyme
Mol. Mass.:67222.47
Organism:Homo sapiens (Human)
Description:P22460
Residue:613
BDBM50279106
NameBDBM50279106
Synonyms:4-(4-phenoxybutoxy)-7H-furo[3,2-g]chromen-7-one CHEMBL444449
TypeSmall organic molecule
Emp. Form.C21H18O5
Mol. Mass.350.3646
SMILESO=c1ccc2c(OCCCCOc3ccccc3)c3ccoc3cc2o1