Reaction Details
TargetD(3) dopamine receptor
LigandBDBM50132069
Substrate/Competitorn/a
Meas. Tech.ChEMBL_687312 (CHEMBL1291988)
Ki 0.34±n/a nM
Citation Höfling, SBMaschauer, SHübner, HGmeiner, PWester, HJPrante, OHeinrich, MR Synthesis, biological evaluation and radiolabelling by 18F-fluoroarylation of a dopamine D3-selective ligand as prospective imaging probe for PET. Bioorg Med Chem Lett20:6933-7 (2010) 
 
D(3) dopamine receptor
Name:D(3) dopamine receptor
Type:n/a
Mol. Mass.:44243.43
Organism:Homo sapiens (Human)
Description:n/a
Residue:400
BDBM50132069
NameBDBM50132069
Synonyms:3-(4-Fluoro-phenyl)-N-{4-[4-(2-methoxy-phenyl)-piperazin-1-yl]-butyl}-acrylamide | CHEMBL338606
TypeSmall organic molecule
Emp. Form.C24H30FN3O2
Mol. Mass.411.5123
SMILESCOc1ccccc1N1CCN(CCCCNC(=O)\C=C\c2ccc(F)cc2)CC1