Reaction Details
Target5-hydroxytryptamine receptor 2A
LigandBDBM50331549
Substrate/Competitorn/a
Meas. Tech.ChEMBL_687309 (CHEMBL1291985)
Ki 230±n/a nM
Citation Höfling, SBMaschauer, SHübner, HGmeiner, PWester, HJPrante, OHeinrich, MR Synthesis, biological evaluation and radiolabelling by 18F-fluoroarylation of a dopamine D3-selective ligand as prospective imaging probe for PET. Bioorg Med Chem Lett20:6933-7 (2010) 
 
5-hydroxytryptamine receptor 2A
Name:5-hydroxytryptamine receptor 2A
Type:Enzyme Catalytic Domain
Mol. Mass.:52679.13
Organism:PIG
Description:5-HT2 0 0::P50129
Residue:470
BDBM50331549
NameBDBM50331549
Synonyms:CHEMBL567286 | [11C]-3-(2-oxo-3-(2-(4-(trifluoromethyl)piperidin-1-yl)ethyl)imidazolidin-1-yl)benzonitrile
TypeSmall organic molecule
Emp. Form.C18H21F3N4O
Mol. Mass.366.3807
SMILESFC(F)(F)C1CCN(CCN2CCN(C2=O)c2cccc(c2)C#N)CC1