Reaction Details
TargetCathepsin L2
LigandBDBM50331555
Substrate/Competitorn/a
Meas. Tech.ChEMBL_687420 (CHEMBL1292096)
IC50 29.5±n/a nM
Citation Cai, JRobinson, JBelshaw, SEverett, KFradera, Xvan Zeeland, Mvan Berkom, Lvan Rijnsbergen, PPopplestone, LBaugh, MDempster, MBruin, JHamilton, WKinghorn, EWestwood, PKerr, JRankovic, ZArbuckle, WBennett, DJJones, PSLong, CMartin, IUitdehaag, JCMeulemans, T Trifluoromethylphenyl as P2 for ketoamide-based cathepsin S inhibitors. Bioorg Med Chem Lett20:6890-4 (2010) 
 
Cathepsin L2
Name:Cathepsin L2
Type:Enzyme
Mol. Mass.:37341.06
Organism:Homo sapiens (Human)
Description:O60911
Residue:334
BDBM50331555
NameBDBM50331555
Synonyms:CHEMBL1289305 | N-(1-(1H-pyrazol-3-ylamino)-1,2-dioxopentan-3-yl)-2-chloro-3-(trifluoromethyl)benzamide
TypeSmall organic molecule
Emp. Form.C16H14ClF3N4O3
Mol. Mass.402.756
SMILESCCC(NC(=O)c1cccc(c1Cl)C(F)(F)F)C(=O)C(=O)Nc1ccn[nH]1