Reaction Details
TargetCathepsin S
LigandBDBM50331555
Substrate/Competitorn/a
Meas. Tech.ChEMBL_687416 (CHEMBL1292092)
IC50 2.3±n/a nM
Citation Cai, JRobinson, JBelshaw, SEverett, KFradera, Xvan Zeeland, Mvan Berkom, Lvan Rijnsbergen, PPopplestone, LBaugh, MDempster, MBruin, JHamilton, WKinghorn, EWestwood, PKerr, JRankovic, ZArbuckle, WBennett, DJJones, PSLong, CMartin, IUitdehaag, JCMeulemans, T Trifluoromethylphenyl as P2 for ketoamide-based cathepsin S inhibitors. Bioorg Med Chem Lett20:6890-4 (2010) 
 
Cathepsin S
Name:Cathepsin S
Type:Protein
Mol. Mass.:37507.38
Organism:Homo sapiens (Human)
Description:P25774
Residue:331
BDBM50331555
NameBDBM50331555
Synonyms:CHEMBL1289305 | N-(1-(1H-pyrazol-3-ylamino)-1,2-dioxopentan-3-yl)-2-chloro-3-(trifluoromethyl)benzamide
TypeSmall organic molecule
Emp. Form.C16H14ClF3N4O3
Mol. Mass.402.756
SMILESCCC(NC(=O)c1cccc(c1Cl)C(F)(F)F)C(=O)C(=O)Nc1ccn[nH]1