Reaction Details
TargetCathepsin S
LigandBDBM50331556
Substrate/Competitorn/a
Meas. Tech.ChEMBL_687416 (CHEMBL1292092)
IC50 1±n/a nM
Citation Cai, JRobinson, JBelshaw, SEverett, KFradera, Xvan Zeeland, Mvan Berkom, Lvan Rijnsbergen, PPopplestone, LBaugh, MDempster, MBruin, JHamilton, WKinghorn, EWestwood, PKerr, JRankovic, ZArbuckle, WBennett, DJJones, PSLong, CMartin, IUitdehaag, JCMeulemans, T Trifluoromethylphenyl as P2 for ketoamide-based cathepsin S inhibitors. Bioorg Med Chem Lett20:6890-4 (2010) 
 
Cathepsin S
Name:Cathepsin S
Type:Protein
Mol. Mass.:37507.38
Organism:Homo sapiens (Human)
Description:P25774
Residue:331
BDBM50331556
NameBDBM50331556
Synonyms:2-chloro-N-(4-(1-methyl-1H-pyrazol-3-ylamino)-3,4-dioxobutan-2-yl)-4-(pyridin-2-ylmethoxy)-3-(trifluoromethyl)benzamide | CHEMBL1289644
TypeSmall organic molecule
Emp. Form.C22H19ClF3N5O4
Mol. Mass.509.866
SMILESCC(NC(=O)c1ccc(OCc2ccccn2)c(c1Cl)C(F)(F)F)C(=O)C(=O)Nc1ccn(C)n1