Reaction Details
TargetVascular endothelial growth factor receptor 3
LigandBDBM50331614
Substrate/Competitorn/a
Meas. Tech.ChEMBL_687450 (CHEMBL1292126)
Ki>1000000±n/a nM
Citation Krug, MErlenkamp, GSippl, WSchächtele, CTotzke, FHilgeroth, A Discovery and selectivity-profiling of 4-benzylamino 1-aza-9-oxafluorene derivatives as lead structures for IGF-1R inhibitors. Bioorg Med Chem Lett20:6915-9 (2010) 
 
Vascular endothelial growth factor receptor 3
Name:Vascular endothelial growth factor receptor 3
Type:Protein
Mol. Mass.:152749.58
Organism:Homo sapiens (Human)
Description:P35916-2
Residue:1363
BDBM50331614
NameBDBM50331614
Synonyms:CHEMBL1290178 | N-(pyridin-3-ylmethyl)benzofuro[2,3-b]pyridin-4-amine
TypeSmall organic molecule
Emp. Form.C17H13N3O
Mol. Mass.275.3046
SMILESC(Nc1ccnc2oc3ccccc3c12)c1cccnc1