Reaction Details
TargetInsulin receptor-related protein
LigandBDBM50331612
Substrate/Competitorn/a
Meas. Tech.ChEMBL_687456 (CHEMBL1292132)
IC50 182000±n/a nM
Citation Krug, MErlenkamp, GSippl, WSchächtele, CTotzke, FHilgeroth, A Discovery and selectivity-profiling of 4-benzylamino 1-aza-9-oxafluorene derivatives as lead structures for IGF-1R inhibitors. Bioorg Med Chem Lett20:6915-9 (2010) 
 
Insulin receptor-related protein
Name:Insulin receptor-related protein
Type:PROTEIN
Mol. Mass.:143716.96
Organism:Homo sapiens (Human)
Description:ChEMBL_774555
Residue:1297
BDBM50331612
NameBDBM50331612
Synonyms:CHEMBL1290072 | N-(4-methoxybenzyl)benzofuro[2,3-b]pyridin-4-amine
TypeSmall organic molecule
Emp. Form.C19H16N2O2
Mol. Mass.304.3425
SMILESCOc1ccc(CNc2ccnc3oc4ccccc4c23)cc1