Reaction Details
TargetInsulin-like growth factor 1 receptor
LigandBDBM50331614
Substrate/Competitorn/a
Meas. Tech.ChEMBL_687448 (CHEMBL1292124)
Ki>1000000±n/a nM
Citation Krug, MErlenkamp, GSippl, WSchächtele, CTotzke, FHilgeroth, A Discovery and selectivity-profiling of 4-benzylamino 1-aza-9-oxafluorene derivatives as lead structures for IGF-1R inhibitors. Bioorg Med Chem Lett20:6915-9 (2010) 
 
Insulin-like growth factor 1 receptor
Name:Insulin-like growth factor 1 receptor
Type:Protein
Mol. Mass.:154776.79
Organism:Homo sapiens (Human)
Description:P08069
Residue:1367
BDBM50331614
NameBDBM50331614
Synonyms:CHEMBL1290178 | N-(pyridin-3-ylmethyl)benzofuro[2,3-b]pyridin-4-amine
TypeSmall organic molecule
Emp. Form.C17H13N3O
Mol. Mass.275.3046
SMILESC(Nc1ccnc2oc3ccccc3c12)c1cccnc1