Reaction Details
TargetProthrombin
LigandBDBM50331668
Substrate/Competitorn/a
Meas. Tech.ChEMBL_687650 (CHEMBL1290974)
IC50 67900±n/a nM
Citation Hanessian, SLarsson, AFex, TKnecht, WBlomberg, N Design and synthesis of macrocyclic indoles targeting blood coagulation cascade Factor XIa. Bioorg Med Chem Lett20:6925-8 (2010) 
 
Prothrombin
Name:Prothrombin
Type:Protein
Mol. Mass.:70029.57
Organism:Homo sapiens (Human)
Description:P00734
Residue:622
BDBM50331668
NameBDBM50331668
Synonyms:CHEMBL1289860
TypeSmall organic molecule
Emp. Form.C28H39ClN4O4S
Mol. Mass.563.152
SMILESCC(C)C[C@@H]1NC(=O)[C@H](NS(=O)(=O)CC\C=C\Cc2[nH]c3ccc(Cl)cc3c2CNC1=O)C1CCCCC1