Reaction Details
TargetProthrombin
LigandBDBM50331669
Substrate/Competitorn/a
Meas. Tech.ChEMBL_687650 (CHEMBL1290974)
Ki 1.3±n/a nM
Citation Hanessian, SLarsson, AFex, TKnecht, WBlomberg, N Design and synthesis of macrocyclic indoles targeting blood coagulation cascade Factor XIa. Bioorg Med Chem Lett20:6925-8 (2010) 
 
Prothrombin
Name:Prothrombin
Type:Protein
Mol. Mass.:70029.57
Organism:Homo sapiens (Human)
Description:P00734
Residue:622
BDBM50331669
NameBDBM50331669
Synonyms:(6R,21AS)-17-CHLORO-6-CYCLOHEXYL-2,3,6,7,10,11,19,20-OCTAHYDRO-1H,5H-PYRROLO[1,2-K][1,4,8,11,14]BENZOXATETRAAZA-CYCLOHEPTADECINE-5,8,12,21(9H,13H,21AH)-TETRONE | CHEMBL1236167
TypeSmall organic molecule
Emp. Form.C25H33ClN4O5
Mol. Mass.505.006
SMILESClc1ccc2OCC(=O)NCCC(=O)N[C@H](C3CCCCC3)C(=O)N3CCC[C@H]3C(=O)NCc2c1