Reaction Details
TargetProthrombin
LigandBDBM50331671
Substrate/Competitorn/a
Meas. Tech.ChEMBL_687650 (CHEMBL1290974)
IC50 8700±n/a nM
Citation Hanessian, SLarsson, AFex, TKnecht, WBlomberg, N Design and synthesis of macrocyclic indoles targeting blood coagulation cascade Factor XIa. Bioorg Med Chem Lett20:6925-8 (2010) 
 
Prothrombin
Name:Prothrombin
Type:Protein
Mol. Mass.:70029.57
Organism:Homo sapiens (Human)
Description:P00734
Residue:622
BDBM50331671
NameBDBM50331671
Synonyms:CHEMBL256744 | micropeptin 103
TypeSmall organic molecule
Emp. Form.C52H72N10O13
Mol. Mass.1045.1873
SMILESCCCCCC(=O)NCC(=O)N[C@@H]([C@@H](C)O)C(=O)N[C@H]1[C@@H](C)OC(=O)[C@@H](NC(=O)[C@H](Cc2c[nH]c3ccccc23)N(C)C(=O)[C@H](Cc2ccccc2)N2[C@H](O)CC[C@H](NC(=O)[C@H](CCC(N)=O)NC1=O)C2=O)C(C)C