Reaction Details
TargetCoagulation factor XI
LigandBDBM50331665
Substrate/Competitorn/a
Meas. Tech.ChEMBL_687648 (CHEMBL1290972)
IC50 135800±n/a nM
Citation Hanessian, SLarsson, AFex, TKnecht, WBlomberg, N Design and synthesis of macrocyclic indoles targeting blood coagulation cascade Factor XIa. Bioorg Med Chem Lett20:6925-8 (2010) 
 
Coagulation factor XI
Name:Coagulation factor XI
Type:Enzyme
Mol. Mass.:70130.58
Organism:Homo sapiens (Human)
Description:P03951
Residue:625
BDBM50331665
NameBDBM50331665
Synonyms:(4S,7R,10S)-18-chloro-7-cyclohexyl-4-isobutyl-10-phenyl-4,5,7,8,10,11-hexahydro-1H-[1,4,7]triazacyclohexadeca[10,9-b]indole-3,6,9(2H,14H,15H)-trione | CHEMBL1288926
TypeSmall organic molecule
Emp. Form.C35H43ClN4O3
Mol. Mass.603.194
SMILESCC(C)C[C@@H]1NC(=O)[C@H](NC(=O)[C@@H](C\C=C\Cc2[nH]c3ccc(Cl)cc3c2CNC1=O)c1ccccc1)C1CCCCC1