Reaction Details
TargetCoagulation factor XI
LigandBDBM50331666
Substrate/Competitorn/a
Meas. Tech.ChEMBL_687648 (CHEMBL1290972)
IC50 145900±n/a nM
Citation Hanessian, SLarsson, AFex, TKnecht, WBlomberg, N Design and synthesis of macrocyclic indoles targeting blood coagulation cascade Factor XIa. Bioorg Med Chem Lett20:6925-8 (2010) 
 
Coagulation factor XI
Name:Coagulation factor XI
Type:Enzyme
Mol. Mass.:70130.58
Organism:Homo sapiens (Human)
Description:P03951
Residue:625
BDBM50331666
NameBDBM50331666
Synonyms:(S)-N-((R)-2-((S)-1-((2-allyl-5-chloro-1H-indol-3-yl)methylamino)-4-methyl-1-oxopentan-2-ylamino)-1-cyclohexyl-2-oxoethyl)-2-phenylpent-4-enamide | CHEMBL1288925
TypeSmall organic molecule
Emp. Form.C37H47ClN4O3
Mol. Mass.631.247
SMILESCC(C)C[C@H](NC(=O)[C@H](NC(=O)[C@@H](CC=C)c1ccccc1)C1CCCCC1)C(=O)NCc1c(CC=C)[nH]c2ccc(Cl)cc12