Reaction Details
TargetCoagulation factor XI
LigandBDBM50331667
Substrate/Competitorn/a
Meas. Tech.ChEMBL_687648 (CHEMBL1290972)
IC50 103100±n/a nM
Citation Hanessian, SLarsson, AFex, TKnecht, WBlomberg, N Design and synthesis of macrocyclic indoles targeting blood coagulation cascade Factor XIa. Bioorg Med Chem Lett20:6925-8 (2010) 
 
Coagulation factor XI
Name:Coagulation factor XI
Type:Enzyme
Mol. Mass.:70130.58
Organism:Homo sapiens (Human)
Description:P03951
Residue:625
BDBM50331667
NameBDBM50331667
Synonyms:CHEMBL1290074 | N-((R)-2-((S)-1-((2-allyl-5-chloro-1H-indol-3-yl)methylamino)-4-methyl-1-oxopentan-2-ylamino)-1-cyclohexyl-2-oxoethyl)pent-4-enamide
TypeSmall organic molecule
Emp. Form.C31H43ClN4O3
Mol. Mass.555.151
SMILESCC(C)C[C@H](NC(=O)[C@H](NC(=O)CCC=C)C1CCCCC1)C(=O)NCc1c(CC=C)[nH]c2ccc(Cl)cc12