Reaction Details
TargetC-C chemokine receptor type 2
LigandBDBM50331726
Substrate/Competitorn/a
Meas. Tech.ChEMBL_687875 (CHEMBL1291439)
IC50 2.3±n/a nM
Citation Xue, CBWang, AMeloni, DZhang, KKong, LFeng, HGlenn, JHuang, TZhang, YCao, GAnand, RZheng, CXia, MHan, QRobinson, DJStorace, LShao, LLi, MBrodmerkel, CMCovington, MScherle, PDiamond, SYeleswaram, SVaddi, KNewton, RHollis, GFriedman, SMetcalf, B Discovery of INCB3344, a potent, selective and orally bioavailable antagonist of human and murine CCR2. Bioorg Med Chem Lett20:7473-8 (2010) 
 
C-C chemokine receptor type 2
Name:C-C chemokine receptor type 2
Type:Enzyme
Mol. Mass.:41932.32
Organism:Homo sapiens (Human)
Description:P41597
Residue:374
BDBM50331726
NameBDBM50331726
Synonyms:CHEMBL1289083 | N-(2-((3S,4S)-4-ethoxy-1-(cis-4-hydroxy-4-phenylcyclohexyl)pyrrolidin-3-ylamino)-2-oxoethyl)-3-(trifluoromethyl)benzamide
TypeSmall organic molecule
Emp. Form.C28H34F3N3O4
Mol. Mass.533.5825
SMILESCCO[C@H]1CN(C[C@@H]1NC(=O)CNC(=O)c1cccc(c1)C(F)(F)F)[C@H]1CC[C@](O)(CC1)c1ccccc1