Reaction Details
TargetC-C chemokine receptor type 2
LigandBDBM50331728
Substrate/Competitorn/a
Meas. Tech.ChEMBL_687876 (CHEMBL1291440)
IC50 9.5±n/a nM
Citation Xue, CBWang, AMeloni, DZhang, KKong, LFeng, HGlenn, JHuang, TZhang, YCao, GAnand, RZheng, CXia, MHan, QRobinson, DJStorace, LShao, LLi, MBrodmerkel, CMCovington, MScherle, PDiamond, SYeleswaram, SVaddi, KNewton, RHollis, GFriedman, SMetcalf, B Discovery of INCB3344, a potent, selective and orally bioavailable antagonist of human and murine CCR2. Bioorg Med Chem Lett20:7473-8 (2010) 
 
C-C chemokine receptor type 2
Name:C-C chemokine receptor type 2
Type:PROTEIN
Mol. Mass.:42795.68
Organism:Mus musculus
Description:ChEMBL_1502265
Residue:373
BDBM50331728
NameBDBM50331728
Synonyms:CHEMBL1289316 | N-(2-((3S,4S)-1-(cis-4-(benzo[d][1,3]dioxol-5-yl)-4-hydroxycyclohexyl)-4-ethoxypyrrolidin-3-ylamino)-2-oxoethyl)-3-(trifluoromethyl)benzamide
TypeSmall organic molecule
Emp. Form.C29H34F3N3O6
Mol. Mass.577.592
SMILESCCO[C@H]1CN(C[C@@H]1NC(=O)CNC(=O)c1cccc(c1)C(F)(F)F)[C@H]1CC[C@](O)(CC1)c1ccc2OCOc2c1