Reaction Details
TargetC-C chemokine receptor type 2
LigandBDBM50331723
Substrate/Competitorn/a
Meas. Tech.ChEMBL_687876 (CHEMBL1291440)
IC50 1.9±n/a nM
Citation Xue, CBWang, AMeloni, DZhang, KKong, LFeng, HGlenn, JHuang, TZhang, YCao, GAnand, RZheng, CXia, MHan, QRobinson, DJStorace, LShao, LLi, MBrodmerkel, CMCovington, MScherle, PDiamond, SYeleswaram, SVaddi, KNewton, RHollis, GFriedman, SMetcalf, B Discovery of INCB3344, a potent, selective and orally bioavailable antagonist of human and murine CCR2. Bioorg Med Chem Lett20:7473-8 (2010) 
 
C-C chemokine receptor type 2
Name:C-C chemokine receptor type 2
Type:PROTEIN
Mol. Mass.:42795.68
Organism:Mus musculus
Description:ChEMBL_1502265
Residue:373
BDBM50331723
NameBDBM50331723
Synonyms:CHEMBL1290637 | N-(2-oxo-2-((3S,4S)-1-(cis-4-phenylcyclohexyl)-4-propoxypyrrolidin-3-ylamino)ethyl)-3-(trifluoromethyl)benzamide
TypeSmall organic molecule
Emp. Form.C29H36F3N3O3
Mol. Mass.531.6096
SMILESCCCO[C@H]1CN(C[C@@H]1NC(=O)CNC(=O)c1cccc(c1)C(F)(F)F)[C@H]1CC[C@H](CC1)c1ccccc1