Reaction Details
TargetThromboxane A2 receptor
LigandBDBM50331730
Substrate/Competitorn/a
Meas. Tech.ChEMBL_686544 (CHEMBL1292331)
Ki 2.51±n/a nM
Citation Li, LBeaulieu, CCarriere, MCDenis, DGreig, GGuay, DO'Neill, GZamboni, RWang, Z Potent and highly selective DP1 antagonists with 2,3,4,9-tetrahydro-1H-carbazole as pharmacophore. Bioorg Med Chem Lett20:7462-5 (2010) 
 
Thromboxane A2 receptor
Name:Thromboxane A2 receptor
Type:Enyzme
Mol. Mass.:37445.28
Organism:Homo sapiens (Human)
Description:P21731
Residue:343
BDBM50331730
NameBDBM50331730
Synonyms:(+/-)-2-(9-(4-chlorobenzyl)-6-fluoro-8-(methylsulfonyl)-2,3,4,9-tetrahydro-1H-carbazol-1-yl)acetic acid | CHEMBL1289984
TypeSmall organic molecule
Emp. Form.C22H21ClFNO4S
Mol. Mass.449.923
SMILESCS(=O)(=O)c1cc(F)cc2c3CCCC(CC(O)=O)c3n(Cc3ccc(Cl)cc3)c12