Reaction Details
TargetProstaglandin E2 receptor EP3 subtype
LigandBDBM50331737
Substrate/Competitorn/a
Meas. Tech.ChEMBL_686548 (CHEMBL1292335)
Ki 830±n/a nM
Citation Li, LBeaulieu, CCarriere, MCDenis, DGreig, GGuay, DO'Neill, GZamboni, RWang, Z Potent and highly selective DP1 antagonists with 2,3,4,9-tetrahydro-1H-carbazole as pharmacophore. Bioorg Med Chem Lett20:7462-5 (2010) 
 
Prostaglandin E2 receptor EP3 subtype
Name:Prostaglandin E2 receptor EP3 subtype
Type:Enzyme
Mol. Mass.:43335.03
Organism:Homo sapiens (Human)
Description:P43115
Residue:390
BDBM50331737
NameBDBM50331737
Synonyms:2-((R)-6-fluoro-8-(methylsulfonyl)-9-((S)-1-(4-(trifluoromethyl)phenyl)ethyl)-2,3,4,9-tetrahydro-1H-carbazol-1-yl)acetic acid | CHEMBL1290413
TypeSmall organic molecule
Emp. Form.C24H23F4NO4S
Mol. Mass.497.502
SMILESC[C@@H](c1ccc(cc1)C(F)(F)F)n1c2[C@@H](CC(O)=O)CCCc2c2cc(F)cc(c12)S(C)(=O)=O