Reaction Details
TargetProstaglandin D2 receptor
LigandBDBM50331737
Substrate/Competitorn/a
Meas. Tech.ChEMBL_686553 (CHEMBL1292340)
IC50 2.5±n/a nM
Citation Li, LBeaulieu, CCarriere, MCDenis, DGreig, GGuay, DO'Neill, GZamboni, RWang, Z Potent and highly selective DP1 antagonists with 2,3,4,9-tetrahydro-1H-carbazole as pharmacophore. Bioorg Med Chem Lett20:7462-5 (2010) 
 
Prostaglandin D2 receptor
Name:Prostaglandin D2 receptor
Type:Enzyme
Mol. Mass.:40288.87
Organism:Homo sapiens (Human)
Description:Q13258
Residue:359
BDBM50331737
NameBDBM50331737
Synonyms:2-((R)-6-fluoro-8-(methylsulfonyl)-9-((S)-1-(4-(trifluoromethyl)phenyl)ethyl)-2,3,4,9-tetrahydro-1H-carbazol-1-yl)acetic acid | CHEMBL1290413
TypeSmall organic molecule
Emp. Form.C24H23F4NO4S
Mol. Mass.497.502
SMILESC[C@@H](c1ccc(cc1)C(F)(F)F)n1c2[C@@H](CC(O)=O)CCCc2c2cc(F)cc(c12)S(C)(=O)=O