Reaction Details
TargetCathepsin K
LigandBDBM50331768
Substrate/Competitorn/a
Meas. Tech.ChEMBL_686701 (CHEMBL1290881)
IC50 2±n/a nM
Citation Beaulieu, CIsabel, EFortier, AMassé, FMellon, CMéthot, NNdao, MNicoll-Griffith, DLee, DPark, HBlack, WC Identification of potent and reversible cruzipain inhibitors for the treatment of Chagas disease. Bioorg Med Chem Lett20:7444-9 (2010) 
 
Cathepsin K
Name:Cathepsin K
Type:Enzyme
Mol. Mass.:36975.68
Organism:Homo sapiens (Human)
Description:P43235
Residue:329
BDBM50331768
NameBDBM50331768
Synonyms:(S)-N-((S)-1-cyano-2-(4-cyano-2-fluorophenyl)ethyl)-2-((S)-1-(4'-((R)-2,2-difluoro-1-hydroxyethyl)biphenyl-4-yl)-2,2,2-trifluoroethylamino)-3-methylbutanamide | CHEMBL1288532
TypeSmall organic molecule
Emp. Form.C31H28F6N4O2
Mol. Mass.602.57
SMILESCC(C)[C@H](N[C@@H](c1ccc(cc1)-c1ccc(cc1)[C@@H](O)C(F)F)C(F)(F)F)C(=O)N[C@@H](Cc1ccc(cc1F)C#N)C#N