Reaction Details
TargetCathepsin L2
LigandBDBM50331769
Substrate/Competitorn/a
Meas. Tech.ChEMBL_686702 (CHEMBL1290882)
IC50 28±n/a nM
Citation Beaulieu, CIsabel, EFortier, AMassé, FMellon, CMéthot, NNdao, MNicoll-Griffith, DLee, DPark, HBlack, WC Identification of potent and reversible cruzipain inhibitors for the treatment of Chagas disease. Bioorg Med Chem Lett20:7444-9 (2010) 
 
Cathepsin L2
Name:Cathepsin L2
Type:Enzyme
Mol. Mass.:37341.06
Organism:Homo sapiens (Human)
Description:O60911
Residue:334
BDBM50331769
NameBDBM50331769
Synonyms:(S)-N-((S)-1-cyano-2-(4-cyano-2-fluorophenyl)ethyl)-3-methyl-2-((S)-2,2,2-trifluoro-1-(4'-(methylsulfonyl)biphenyl-4-yl)ethylamino)butanamide | CHEMBL1288530
TypeSmall organic molecule
Emp. Form.C30H28F4N4O3S
Mol. Mass.600.627
SMILESCC(C)[C@H](N[C@@H](c1ccc(cc1)-c1ccc(cc1)S(C)(=O)=O)C(F)(F)F)C(=O)N[C@@H](Cc1ccc(cc1F)C#N)C#N