Reaction Details
TargetCruzipain
LigandBDBM19518
Substrate/Competitorn/a
Meas. Tech.ChEMBL_686696 (CHEMBL1290876)
IC50 1.8±n/a nM
Citation Beaulieu, CIsabel, EFortier, AMassé, FMellon, CMéthot, NNdao, MNicoll-Griffith, DLee, DPark, HBlack, WC Identification of potent and reversible cruzipain inhibitors for the treatment of Chagas disease. Bioorg Med Chem Lett20:7444-9 (2010) 
 
Cruzipain
Name:Cruzipain
Type:Protein
Mol. Mass.:49831.41
Organism:Trypanosoma cruzi
Description:P25779
Residue:467
BDBM19518
NameBDBM19518
Synonyms:(2S)-N-(cyanomethyl)-4-methyl-2-{[(1S)-2,2,2-trifluoro-1-{4-[4-(piperazin-1-yl)phenyl]phenyl}ethyl]amino}pentanamide trifluoroethylamine analogue, 1
TypeSmall organic molecule
Emp. Form.C26H32F3N5O
Mol. Mass.487.5604
SMILESCC(C)C[C@H](N[C@@H](c1ccc(cc1)-c1ccc(cc1)N1CCNCC1)C(F)(F)F)C(=O)NCC#N