Reaction Details
TargetCruzipain
LigandBDBM50331776
Substrate/Competitorn/a
Meas. Tech.ChEMBL_686696 (CHEMBL1290876)
IC50 0.1±n/a nM
Citation Beaulieu, CIsabel, EFortier, AMassé, FMellon, CMéthot, NNdao, MNicoll-Griffith, DLee, DPark, HBlack, WC Identification of potent and reversible cruzipain inhibitors for the treatment of Chagas disease. Bioorg Med Chem Lett20:7444-9 (2010) 
 
Cruzipain
Name:Cruzipain
Type:Protein
Mol. Mass.:49831.41
Organism:Trypanosoma cruzi
Description:P25779
Residue:467
BDBM50331776
NameBDBM50331776
Synonyms:(S)-4,4-dichloro-N-((S)-1-cyano-2-phenylethyl)-2-((S)-2,2,2-trifluoro-1-(4'-(methylsulfonyl)biphenyl-4-yl)ethylamino)butanamide | CHEMBL1290084
TypeSmall organic molecule
Emp. Form.C28H26Cl2F3N3O3S
Mol. Mass.612.491
SMILESCS(=O)(=O)c1ccc(cc1)-c1ccc(cc1)[C@H](N[C@@H](CC(Cl)Cl)C(=O)N[C@@H](Cc1ccccc1)C#N)C(F)(F)F